Target
Cyclin-dependent kinase 5
Ligand
BDBM50155234
Substrate
Meas. Tech.
ChEMBL_306160 (CHEMBL832348)
IC50
102±n/a nM
Citation
 Helal, CJSanner, MACooper, CBGant, TAdam, MLucas, JCKang, ZKupchinsky, SAhlijanian, MKTate, BMenniti, FSKelly, KPeterson, M Discovery and SAR of 2-aminothiazole inhibitors of cyclin-dependent kinase 5/p25 as a potential treatment for Alzheimer's disease. Bioorg Med Chem Lett 14:5521-5 (2004)  
Target
Name:
Cyclin-dependent kinase 5
Synonyms:
CDK5 CDKN5 Cyclin-dependent kinase 5 (CDK5/ p25) Cyclin-dependent-like kinase 5 PSSALRE Tau protein kinase II catalytic subunit
Type:
Enzyme Subunit
Mol. Mass.:
33308.61
Organism:
Homo sapiens (Human)
Description:
Residue:
292
  
Inhibitor
Name:
BDBM50155234
Synonyms:
1-(5-Isopropyl-thiazol-2-yl)-3-phenyl-urea | CHEMBL186510
Type:
Small organic molecule
Emp. Form.:
C13H15N3OS
Mol. Mass.:
261.343
SMILES:
CC(C)c1cnc(NC(=O)Nc2ccccc2)s1
: