Target
Sodium-dependent dopamine transporter
Ligand
BDBM50155459
Substrate
Meas. Tech.
ChEMBL_303354 (CHEMBL838689)
Ki
0.57±n/a nM
Citation
 Peng, XZhang, AKula, NSBaldessarini, RJNeumeyer, JL Synthesis and amine transporter affinities of novel phenyltropane derivatives as potential positron emission tomography (PET) imaging agents. Bioorg Med Chem Lett 14:5635-9 (2004)  
Target
Name:
Sodium-dependent dopamine transporter
Synonyms:
DA transporter SC6A3_RAT Sodium-dependent dopamine transporter | Sodium-dependent dopamine transporter (DAT)
Type:
Multi-pass membrane protein
Mol. Mass.:
68749.45
Organism:
Rattus norvegicus (rat)
Description:
P23977
Residue:
619
  
Inhibitor
Name:
BDBM50155459
Synonyms:
3-(4-Bromo-phenyl)-8-aza-bicyclo[3.2.1]octane-2-carboxylic acid 2-fluoro-ethyl ester | CHEMBL186119
Type:
Small organic molecule
Emp. Form.:
C16H19BrFNO2
Mol. Mass.:
356.23
SMILES:
FCCOC(=O)C1C2CCC(CC1c1ccc(Br)cc1)N2
: