Target
1,25-dihydroxyvitamin D(3) 24-hydroxylase, mitochondrial
Ligand
BDBM50155470
Substrate
Meas. Tech.
ChEMBL_305549 (CHEMBL828568)
IC50
2100±n/a nM
Citation
 Yee, SWSimons, C Synthesis and CYP24 inhibitory activity of 2-substituted-3,4-dihydro-2H-naphthalen-1-one (tetralone) derivatives. Bioorg Med Chem Lett 14:5651-4 (2004)  
Target
Name:
1,25-dihydroxyvitamin D(3) 24-hydroxylase, mitochondrial
Synonyms:
CP24A_RAT Cyp24a1 | Cytochrome P450 24A1
Type:
PROTEIN
Mol. Mass.:
59467.61
Organism:
Rattus norvegicus
Description:
ChEMBL_305549
Residue:
514
  
Inhibitor
Name:
BDBM50155470
Synonyms:
2-biphenyl-2-ylmethyl-6-hydroxy-3,4-dihydro-2H-naphthalen-1-one | CHEMBL361073
Type:
Small organic molecule
Emp. Form.:
C23H20O2
Mol. Mass.:
328.4037
SMILES:
Oc1ccc2C(=O)C(Cc3ccccc3-c3ccccc3)CCc2c1
: