Target
P2X purinoceptor 7
Ligand
BDBM50126720
Substrate
Meas. Tech.
ChEMBL_302136 (CHEMBL841760)
Kd
3.6±n/a nM
Citation
 Romagnoli, RBaraldi, PGPavani, MGTabrizi, MAMoorman, ARDi Virgilio, FCattabriga, EPancaldi, CGessi, SBorea, PA Synthesis, radiolabeling, and preliminary biological evaluation of [3H]-1-[(S)-N,O-bis-(isoquinolinesulfonyl)-N-methyl-tyrosyl]-4-(o-tolyl)-piperazine, a potent antagonist radioligand for the P2X7 receptor. Bioorg Med Chem Lett 14:5709-12 (2004)  
Target
Name:
P2X purinoceptor 7
Synonyms:
ATP receptor P2RX7_HUMAN P2X purinoceptor 7 (P2X7) P2Z receptor | Purinergic receptor
Type:
Protein
Mol. Mass.:
68602.85
Organism:
Homo sapiens (Human)
Description:
Q99572
Residue:
595
  
Inhibitor
Name:
BDBM50126720
Synonyms:
(S)-4-(2-(N-methylisoquinoline-5-sulfonamido)-3-oxo-3-(4-o-tolylpiperazin-1-yl)propyl)phenyl isoquinoline-5-sulfonate Isoquinoline-5-sulfonic acid 4-[(S)-2-[(isoquinoline-5-sulfonyl)-methyl-amino]-3-oxo-3-(4-o-tolyl-piperazin-1-yl)-propyl]-phenyl ester
Type:
Small organic molecule
Emp. Form.:
C39H37N5O6S2
Mol. Mass.:
735.871
SMILES:
CN([C@@H](Cc1ccc(OS(=O)(=O)c2cccc3cnccc23)cc1)C(=O)N1CCN(CC1)c1ccccc1C)S(=O)(=O)c1cccc2cnccc12
: