Target
Melatonin receptor type 1B
Ligand
BDBM50155744
Substrate
Meas. Tech.
ChEMBL_305097 (CHEMBL832401)
IC50
24±n/a nM
Citation
 Karageorge, GNBertenshaw, SIben, LXu, CSarbin, NGentile, ADubowchik, GM Tetrahydroisoquinoline derivatives as melatonin MT2 receptor antagonists. Bioorg Med Chem Lett 14:5881-4 (2004)  
Target
Name:
Melatonin receptor type 1B
Synonyms:
MTNR1B Mel-1B-R Melatonin 1B Melatonin receptor type 1B | Melatonin receptor type 2 (MT2)
Type:
Enzyme
Mol. Mass.:
40203.54
Organism:
Homo sapiens (Human)
Description:
P49286
Residue:
362
  
Inhibitor
Name:
BDBM50155744
Synonyms:
CHEMBL365648 | Cyclobutyl-(6,7-dimethoxy-1-phenethyl-3,4-dihydro-1H-isoquinolin-2-yl)-methanone
Type:
Small organic molecule
Emp. Form.:
C24H29NO3
Mol. Mass.:
379.492
SMILES:
COc1cc2CCN(C(CCc3ccccc3)c2cc1OC)C(=O)C1CCC1
: