Target
Steroid hormone receptor ERR1
Ligand
BDBM50155824
Substrate
Meas. Tech.
ChEMBL_305523 (CHEMBL827660)
IC50
1800±n/a nM
Citation
 Busch, BBStevens, WCMartin, ROrdentlich, PZhou, SSapp, DWHorlick, RAMohan, R Identification of a selective inverse agonist for the orphan nuclear receptor estrogen-related receptor alpha. J Med Chem 47:5593-6 (2004)  
Target
Name:
Steroid hormone receptor ERR1
Synonyms:
ERR-alpha ERR1_HUMAN ESRRA Estrogen-Related Receptor, alpha NR3B1 Steroid hormone receptor ERR1 Steroid hormone receptor ERR1/Estrogen-related receptor alpha (ERRa) | von Hippel-Lindau disease tumor suppressor/Steroid hormone receptor ERR1
Type:
PROTEIN
Mol. Mass.:
45508.08
Organism:
Homo sapiens (Human)
Description:
ChEMBL_1499891
Residue:
423
  
Inhibitor
Name:
BDBM50155824
Synonyms:
2-Cyano-N-(5-ethyl-[1,3,4]thiadiazol-2-yl)-3-[3-methoxy-4-(naphthalen-1-ylmethoxy)-phenyl]-acrylamide | CHEMBL364379
Type:
Small organic molecule
Emp. Form.:
C26H22N4O3S
Mol. Mass.:
470.543
SMILES:
CCc1nnc(NC(=O)C(=C\c2ccc(OCc3cccc4ccccc34)c(OC)c2)\C#N)s1
: