Target
Steroid hormone receptor ERR1
Ligand
BDBM50155829
Substrate
Meas. Tech.
ChEMBL_305523 (CHEMBL827660)
IC50
2000±n/a nM
Citation
 Busch, BBStevens, WCMartin, ROrdentlich, PZhou, SSapp, DWHorlick, RAMohan, R Identification of a selective inverse agonist for the orphan nuclear receptor estrogen-related receptor alpha. J Med Chem 47:5593-6 (2004)  
Target
Name:
Steroid hormone receptor ERR1
Synonyms:
ERR-alpha ERR1_HUMAN ESRRA Estrogen-Related Receptor, alpha NR3B1 Steroid hormone receptor ERR1 Steroid hormone receptor ERR1/Estrogen-related receptor alpha (ERRa) | von Hippel-Lindau disease tumor suppressor/Steroid hormone receptor ERR1
Type:
PROTEIN
Mol. Mass.:
45508.08
Organism:
Homo sapiens (Human)
Description:
ChEMBL_1499891
Residue:
423
  
Inhibitor
Name:
BDBM50155829
Synonyms:
2-Cyano-N-[5-(4-dimethylamino-phenyl)-[1,3,4]thiadiazol-2-yl]-3-{4-[2-(2,6-dimethyl-phenoxy)-ethoxy]-3-methoxy-phenyl}-acrylamide | CHEMBL189393
Type:
Small organic molecule
Emp. Form.:
C31H31N5O4S
Mol. Mass.:
569.674
SMILES:
COc1cc(\C=C(/C#N)C(=O)Nc2nnc(s2)-c2ccc(cc2)N(C)C)ccc1OCCOc1c(C)cccc1C
: