Target
Metabotropic glutamate receptor 5
Ligand
BDBM50156076
Substrate
Meas. Tech.
ChEMBL_304169 (CHEMBL830007)
EC50
20±n/a nM
Citation
 Lindsley, CWWisnoski, DDLeister, WHO'brien, JALemaire, WWilliams, DLBurno, MSur, CKinney, GGPettibone, DJTiller, PRSmith, SDuggan, MEHartman, GDConn, PJHuff, JR Discovery of positive allosteric modulators for the metabotropic glutamate receptor subtype 5 from a series of N-(1,3-diphenyl-1H- pyrazol-5-yl)benzamides that potentiate receptor function in vivo. J Med Chem 47:5825-8 (2004)  
Target
Name:
Metabotropic glutamate receptor 5
Synonyms:
GRM5_RAT Grm5 Mglur5 metabotropic glutamate 5/1-C metabotropic glutamate 5a
Type:
Enzyme
Mol. Mass.:
131900.14
Organism:
Rattus norvegicus (Rat)
Description:
P31424
Residue:
1203
  
Inhibitor
Name:
BDBM50156076
Synonyms:
CHEMBL191147 | N-(2,5-Diphenyl-2H-pyrazol-3-yl)-3,4-difluoro-benzamide
Type:
Small organic molecule
Emp. Form.:
C22H15F2N3O
Mol. Mass.:
375.3708
SMILES:
Fc1ccc(cc1F)C(=O)Nc1cc(nn1-c1ccccc1)-c1ccccc1
: