Target
5-hydroxytryptamine receptor 1F
Ligand
BDBM50156404
Substrate
Meas. Tech.
ChEMBL_302837 (CHEMBL827882)
Ki
4.8±n/a nM
Citation
 Zhang, DKohlman, DKrushinski, JLiang, SYing, BPReilly, JEDinn, SRWainscott, DBNutter, SGough, WNelson, DLSchaus, JMXu, YC Design, synthesis and evaluation of bicyclic benzamides as novel 5-HT1F receptor agonists. Bioorg Med Chem Lett 14:6011-6 (2004)  
Target
Name:
5-hydroxytryptamine receptor 1F
Synonyms:
5-HT-1F 5-hydroxytryptamine receptor 1F HTR1EL Serotonin (5-HT) receptor Serotonin receptor 1F
Type:
Enzyme Catalytic Domain
Mol. Mass.:
41724.68
Organism:
Homo sapiens (Human)
Description:
5-HT1F HTR1F HUMAN::P30939
Residue:
366
  
Inhibitor
Name:
BDBM50156404
Synonyms:
4-Fluoro-N-[1-(1-methyl-piperidin-4-yl)-2,3-dihydro-1H-indol-6-yl]-benzamide | CHEMBL361061
Type:
Small organic molecule
Emp. Form.:
C21H24FN3O
Mol. Mass.:
353.4332
SMILES:
CN1CCC(CC1)N1CCc2ccc(NC(=O)c3ccc(F)cc3)cc12
: