Target
Peroxisomal acyl-coenzyme A oxidase 1
Ligand
BDBM50156429
Substrate
Meas. Tech.
ChEMBL_311972 (CHEMBL834389)
IC50
950.0±n/a nM
Citation
 Elzein, EIbrahim, PKoltun, DORehder, KShenk, KDMarquart, TAJiang, BLi, XNatero, RLi, YNguyen, MKerwar, SChu, NSoohoo, DHao, JMaydanik, VYLustig, DAZeng, DLeung, KZablocki, JA CVT-4325: a potent fatty acid oxidation inhibitor with favorable oral bioavailability. Bioorg Med Chem Lett 14:6017-21 (2004)  
Target
Name:
Peroxisomal acyl-coenzyme A oxidase 1
Synonyms:
ACOX1_RAT Acox Palmitoyl-CoA oxidase Peroxisomal acyl-CoA oxidase 1, B chain Peroxisomal acyl-coenzyme A oxidase 1
Type:
PROTEIN
Mol. Mass.:
74693.04
Organism:
Rattus norvegicus
Description:
ChEMBL_311972
Residue:
661
  
Inhibitor
Name:
BDBM50156429
Synonyms:
(R)-1-{4-[5-(4-Isopropyl-phenyl)-[1,2,4]oxadiazol-3-ylmethyl]-piperazin-1-yl}-3-(2-methyl-benzothiazol-5-yloxy)-propan-2-ol | CHEMBL186975
Type:
Small organic molecule
Emp. Form.:
C27H33N5O3S
Mol. Mass.:
507.648
SMILES:
CC(C)c1ccc(cc1)-c1nc(CN2CCN(C[C@@H](O)COc3ccc4sc(C)nc4c3)CC2)no1
: