Target
B1 bradykinin receptor
Ligand
BDBM50156450
Substrate
Meas. Tech.
ChEMBL_303697 (CHEMBL828184)
Ki
0.07±n/a nM
Citation
 Su, DSMarkowitz, MKMurphy, KLWan, BLZrada, MMHarrell, CMO'Malley, SSHess, JFRansom, RWChang, RSWallace, MARaab, CEDean, DCPettibone, DJFreidinger, RMBock, MG Development of an efficient and selective radioligand for bradykinin B1 receptor occupancy studies. Bioorg Med Chem Lett 14:6045-8 (2004)  
Target
Name:
B1 bradykinin receptor
Synonyms:
B1 BRADYKININ B1R BK-1 receptor BRADYB1 | Bradykinin B1 receptor
Type:
Enzyme
Mol. Mass.:
40508.87
Organism:
Homo sapiens (Human)
Description:
P46663
Residue:
353
  
Inhibitor
Name:
BDBM50156450
Synonyms:
2-[(R)-7-Chloro-1-(naphthalene-2-sulfonyl)-3-oxo-1,2,3,4-tetrahydro-quinoxalin-2-yl]-N-{2-[4-(1H-imidazol-2-yl)-phenyl]-ethyl}-acetamide | CHEMBL185727
Type:
Small organic molecule
Emp. Form.:
C31H26ClN5O4S
Mol. Mass.:
600.087
SMILES:
Clc1ccc2NC(=O)[C@@H](CC(=O)NCCc3ccc(cc3)-c3ncc[nH]3)N(c2c1)S(=O)(=O)c1ccc2ccccc2c1
: