Target
B1 bradykinin receptor
Ligand
BDBM50156446
Substrate
Meas. Tech.
ChEMBL_302734 (CHEMBL876354)
Ki
34±n/a nM
Citation
 Su, DSMarkowitz, MKMurphy, KLWan, BLZrada, MMHarrell, CMO'Malley, SSHess, JFRansom, RWChang, RSWallace, MARaab, CEDean, DCPettibone, DJFreidinger, RMBock, MG Development of an efficient and selective radioligand for bradykinin B1 receptor occupancy studies. Bioorg Med Chem Lett 14:6045-8 (2004)  
Target
Name:
B1 bradykinin receptor
Synonyms:
B1 BRADYKININ B1bkr BKRB1_RAT Bkr KB1 | Kinin B1 receptor
Type:
Enzyme Catalytic Domain
Mol. Mass.:
38389.97
Organism:
RAT
Description:
B1 BRADYKININ BDKRB1 RAT::P97583
Residue:
337
  
Inhibitor
Name:
BDBM50156446
Synonyms:
CHEMBL359553 | N-{2-[4-(4,5-Dihydro-1H-imidazol-2-yl)-phenyl]-ethyl}-2-[(R)-1-(naphthalene-2-sulfonyl)-3-oxo-1,2,3,4-tetrahydro-quinoxalin-2-yl]-acetamide
Type:
Small organic molecule
Emp. Form.:
C31H29N5O4S
Mol. Mass.:
567.658
SMILES:
O=C(C[C@H]1N(c2ccccc2NC1=O)S(=O)(=O)c1ccc2ccccc2c1)NCCc1ccc(cc1)C1=NCCN1
: