Target
Disintegrin and metalloproteinase domain-containing protein 12
Ligand
BDBM50062351
Substrate
Meas. Tech.
ChEMBL_306185 (CHEMBL830979)
IC50
5.93±n/a nM
Citation
 Oh, MIm, ILee, YJKim, YHYoon, JHPark, HGHigashiyama, SKim, YCPark, WJ Structure-based virtual screening and biological evaluation of potent and selective ADAM12 inhibitors. Bioorg Med Chem Lett 14:6071-4 (2004)  
Target
Name:
Disintegrin and metalloproteinase domain-containing protein 12
Synonyms:
ADA12_HUMAN MLTN
Type:
PROTEIN
Mol. Mass.:
99581.06
Organism:
Homo sapiens (Human)
Description:
ChEMBL_306185
Residue:
909
  
Inhibitor
Name:
BDBM50062351
Synonyms:
(R)-N*4*-Hydroxy-N*1*-[(S)-2-(1H-indol-3-yl)-1-methylcarbamoyl-ethyl]-2-isobutyl-succinamide (R)-N1-((S)-3-(1H-indol-3-yl)-1-(methylamino)-1-oxopropan-2-yl)-N4-hydroxy-2-isobutylsuccinamide CHEMBL19611 US9487462, ilomastat
Type:
Small organic molecule
Emp. Form.:
C20H28N4O4
Mol. Mass.:
388.4607
SMILES:
CNC(=O)[C@H](Cc1c[nH]c2ccccc12)NC(=O)[C@H](CC(C)C)CC(=O)NO
: