Target
Tubulin beta chain [1-43]
Ligand
BDBM50156485
Substrate
Meas. Tech.
ChEMBL_311631 (CHEMBL833941)
IC50
10500±n/a nM
Citation
 Kim, SPark, JHKoo, SYKim, JIKim, MHKim, JEJo, KChoi, HGLee, SBJung, SH Novel diarylsulfonylurea derivatives as potent antimitotic agents. Bioorg Med Chem Lett 14:6075-8 (2004)  
Target
Name:
Tubulin beta chain [1-43]
Synonyms:
Beta tubulin | TBB_LEIME
Type:
PROTEIN
Mol. Mass.:
4652.47
Organism:
Leishmania donovani
Description:
ChEMBL_311916
Residue:
43
  
Inhibitor
Name:
BDBM50156485
Synonyms:
1-[1-(4-Amino-benzoyl)-2,3-dihydro-1H-indole-5-sulfonyl]-4-thiophen-2-yl-imidazolidin-2-one | CHEMBL362333
Type:
Small organic molecule
Emp. Form.:
C22H20N4O4S2
Mol. Mass.:
468.549
SMILES:
Nc1ccc(cc1)C(=O)N1CCc2cc(ccc12)S(=O)(=O)N1CC(NC1=O)c1cccs1
: