Target
Tubulin beta chain [1-43]
Ligand
BDBM50156483
Substrate
Meas. Tech.
ChEMBL_311631 (CHEMBL833941)
IC50
22000±n/a nM
Citation
 Kim, SPark, JHKoo, SYKim, JIKim, MHKim, JEJo, KChoi, HGLee, SBJung, SH Novel diarylsulfonylurea derivatives as potent antimitotic agents. Bioorg Med Chem Lett 14:6075-8 (2004)  
Target
Name:
Tubulin beta chain [1-43]
Synonyms:
Beta tubulin | TBB_LEIME
Type:
PROTEIN
Mol. Mass.:
4652.47
Organism:
Leishmania donovani
Description:
ChEMBL_311916
Residue:
43
  
Inhibitor
Name:
BDBM50156483
Synonyms:
(S)-1-[1-(2,6-Dichloro-pyridine-4-carbonyl)-2,3-dihydro-1H-indole-5-sulfonyl]-4-phenyl-imidazolidin-2-one | CHEMBL365509
Type:
Small organic molecule
Emp. Form.:
C23H18Cl2N4O4S
Mol. Mass.:
517.384
SMILES:
Clc1cc(cc(Cl)n1)C(=O)N1CCc2cc(ccc12)S(=O)(=O)N1C[C@@H](NC1=O)c1ccccc1
: