Target
Peroxisome proliferator-activated receptor alpha
Ligand
BDBM50157061
Substrate
Meas. Tech.
ChEMBL_304321 (CHEMBL829293)
EC50
1100±n/a nM
Citation
 Martín, JABrooks, DAPrieto, LGonzález, RTorrado, ARojo, ILópez de Uralde, BLamas, CFerritto, RDolores Martín-Ortega, MAgejas, JParra, FRizzo, JRRhodes, GARobey, RLAlt, CAWendel, SRZhang, TYReifel-Miller, AMontrose-Rafizadeh, CBrozinick, JTHawkins, EMisener, EABriere, DAArdecky, RFraser, JDWarshawsky, AM 2-Alkoxydihydrocinnamates as PPAR agonists. Activity modulation by the incorporation of phenoxy substituents. Bioorg Med Chem Lett 15:51-5 (2004)  
Target
Name:
Peroxisome proliferator-activated receptor alpha
Synonyms:
NR1C1 PPAR PPAR-alpha PPARA_HUMAN Peroxisome proliferator-activated receptor | Peroxisome proliferator-activated receptor alpha (PPAR alpha)
Type:
Enzyme
Mol. Mass.:
52222.08
Organism:
Homo sapiens (Human)
Description:
Q07869
Residue:
468
  
Inhibitor
Name:
BDBM50157061
Synonyms:
(S)-3-{4-[3-(Biphenyl-4-yloxy)-propoxy]-phenyl}-2-methoxy-propionic acid | CHEMBL182884
Type:
Small organic molecule
Emp. Form.:
C25H26O5
Mol. Mass.:
406.4709
SMILES:
CO[C@@H](Cc1ccc(OCCCOc2ccc(cc2)-c2ccccc2)cc1)C(O)=O
: