Target
Trypsin
Ligand
BDBM50157099
Substrate
Meas. Tech.
ChEMBL_302473 (CHEMBL826338)
Ki
64±n/a nM
Citation
 Bruncko, MMcClellan, WJWendt, MDSauer, DRGeyer, ADalton, CRKaminski, MAWeitzberg, MGong, JDellaria, JFMantei, RZhao, XNienaber, VLStewart, KKlinghofer, VBouska, JRockway, TWGiranda, VL Naphthamidine urokinase plasminogen activator inhibitors with improved pharmacokinetic properties. Bioorg Med Chem Lett 15:93-8 (2004)  
Target
Name:
Trypsin
Synonyms:
TRYP_PIG
Type:
PROTEIN
Mol. Mass.:
24411.24
Organism:
Sus scrofa
Description:
ChEMBL_1450738
Residue:
231
  
Inhibitor
Name:
BDBM50157099
Synonyms:
4-Bromo-6-carbamimidoyl-naphthalene-2-carboxylic acid phenylamide | CHEMBL182220
Type:
Small organic molecule
Emp. Form.:
C18H14BrN3O
Mol. Mass.:
368.227
SMILES:
NC(=N)c1ccc2cc(cc(Br)c2c1)C(=O)Nc1ccccc1
: