Target
Trypsin
Ligand
BDBM50147088
Substrate
Meas. Tech.
ChEMBL_302473 (CHEMBL826338)
Ki
45±n/a nM
Citation
 Bruncko, MMcClellan, WJWendt, MDSauer, DRGeyer, ADalton, CRKaminski, MAWeitzberg, MGong, JDellaria, JFMantei, RZhao, XNienaber, VLStewart, KKlinghofer, VBouska, JRockway, TWGiranda, VL Naphthamidine urokinase plasminogen activator inhibitors with improved pharmacokinetic properties. Bioorg Med Chem Lett 15:93-8 (2004)  
Target
Name:
Trypsin
Synonyms:
TRYP_PIG
Type:
PROTEIN
Mol. Mass.:
24411.24
Organism:
Sus scrofa
Description:
ChEMBL_1450738
Residue:
231
  
Inhibitor
Name:
BDBM50147088
Synonyms:
6-Carbamimidoyl-4-furan-3-yl-naphthalene-2-carboxylic acid phenylamide | CHEMBL319047
Type:
Small organic molecule
Emp. Form.:
C22H17N3O2
Mol. Mass.:
355.3893
SMILES:
NC(=N)c1ccc2cc(cc(-c3ccoc3)c2c1)C(=O)Nc1ccccc1
: