Target
Protein farnesyltransferase subunit beta/geranylgeranyltransferase type-1 subunit alpha
Ligand
BDBM50157240
Substrate
Meas. Tech.
ChEMBL_310277 (CHEMBL833108)
EC50
90±n/a nM
Citation
 Wang, GTWang, XWang, WHasvold, LASullivan, GHutchins, CWO'Conner, SGentiles, RSowin, TCohen, JGu, WZZhang, HRosenberg, SHSham, HL Design and synthesis of o-trifluoromethylbiphenyl substituted 2-amino-nicotinonitriles as inhibitors of farnesyltransferase. Bioorg Med Chem Lett 15:153-8 (2004)  
Target
Name:
Protein farnesyltransferase subunit beta/geranylgeranyltransferase type-1 subunit alpha
Synonyms:
Protein farnesyltransferase | Protein farnesyltransferase beta/geranylgeranyltransferase type I alpha subunit
Type:
Mol. Mass.:
Description:
ASSAY_ID of EBI is 38702
Components:
This complex has 2 components.
Component 1
Name:
Protein farnesyltransferase/geranylgeranyltransferase type-1 subunit alpha
Synonyms:
CAAX farnesyltransferase subunit alpha FTase-alpha GGTase-I-alpha Protein farnesyltransferase/geranylgeranyltransferase type-1 subunit alpha Type I protein geranyl-geranyltransferase subunit alpha
Type:
PROTEIN
Mol. Mass.:
43994.09
Organism:
Mus musculus
Description:
EBI_10570
Residue:
377
  
Component 2
Name:
Protein farnesyltransferase subunit beta
Synonyms:
FNTB_MOUSE Protein farnesyltransferase
Type:
PROTEIN
Mol. Mass.:
48811.61
Organism:
Mus musculus
Description:
EBI_12341
Residue:
437
  
Inhibitor
Name:
BDBM50157240
Synonyms:
6-[(6-Cyano-2''-trifluoromethyl-biphenyl-3-yl)-(3-methyl-3H-imidazol-4-yl)-methoxymethyl]-nicotinonitrile | CHEMBL181318
Type:
Small organic molecule
Emp. Form.:
C26H18F3N5O
Mol. Mass.:
473.4492
SMILES:
Cn1cncc1C(OCc1ccc(cn1)C#N)c1ccc(C#N)c(c1)-c1ccccc1C(F)(F)F
: