Target
B1 bradykinin receptor
Ligand
BDBM50157512
Substrate
Meas. Tech.
ChEMBL_429973 (CHEMBL917703)
Ki
2±n/a nM
Citation
 Kuduk, SDNg, CFeng, DMWai, JMChang, RSHarrell, CMMurphy, KLRansom, RWReiss, DIvarsson, MMason, GBoyce, STang, CPrueksaritanont, TFreidinger, RMPettibone, DJBock, MG 2,3-diaminopyridine bradykinin B1 receptor antagonists. J Med Chem 47:6439-42 (2004)  
Target
Name:
B1 bradykinin receptor
Synonyms:
B1 BRADYKININ B1R BK-1 receptor BRADYB1 | Bradykinin B1 receptor
Type:
Enzyme
Mol. Mass.:
40508.87
Organism:
Homo sapiens (Human)
Description:
P46663
Residue:
353
  
Inhibitor
Name:
BDBM50157512
Synonyms:
CHEMBL374779 | N-{4-chloro-2-[(R)-1-(2'-cyano-3'-fluoro-biphenyl-4-yl)-ethylamino]-pyridin-3-yl}-2-cyano-acetamide
Type:
Small organic molecule
Emp. Form.:
C23H17ClFN5O
Mol. Mass.:
433.865
SMILES:
C[C@@H](Nc1nccc(Cl)c1NC(=O)CC#N)c1ccc(cc1)-c1cccc(F)c1C#N
: