Target
Telomerase reverse transcriptase
Ligand
BDBM50157542
Substrate
Meas. Tech.
ChEMBL_430015 (CHEMBL917191)
IC50
470±n/a nM
Citation
 Menichincheri, MBallinari, DBargiotti, ABonomini, LCeccarelli, WD'Alessio, RFretta, AMoll, JPolucci, PSoncini, CTibolla, MTrosset, JYVanotti, E Catecholic flavonoids acting as telomerase inhibitors. J Med Chem 47:6466-75 (2004)  
Target
Name:
Telomerase reverse transcriptase
Synonyms:
EST2 TERT TRT
Type:
PROTEIN
Mol. Mass.:
127099.03
Organism:
Homo sapiens (Human)
Description:
ChEMBL_1447029
Residue:
1132
  
Inhibitor
Name:
BDBM50157542
Synonyms:
2-{2-[3-(dimethylamino)propyl]-1H-benzimidazol-5-yl}-7,8-dimethoxy-4H-chromen-4-one | CHEMBL376279
Type:
Small organic molecule
Emp. Form.:
C23H25N3O4
Mol. Mass.:
407.4623
SMILES:
COc1ccc2c(oc(cc2=O)-c2ccc3nc(CCCN(C)C)[nH]c3c2)c1OC
: