Target
5-hydroxytryptamine receptor 7
Ligand
BDBM21368
Substrate
Meas. Tech.
ChEMBL_430137 (CHEMBL919046)
EC50
6320±n/a nM
Citation
 Leopoldo, MBerardi, FColabufo, NAContino, MLacivita, ENiso, MPerrone, RTortorella, V Structure-affinity relationship study on N-(1,2,3,4-tetrahydronaphthalen-1-yl)-4-aryl-1-piperazinealkylamides, a new class of 5-hydroxytryptamine7 receptor agents. J Med Chem 47:6616-24 (2004)  
Target
Name:
5-hydroxytryptamine receptor 7
Synonyms:
5-HT-7 5-HT7 5-HT7S 5HT7 HTR7 | Serotonin receptor 7
Type:
G Protein-Coupled Receptor (GPCR)
Mol. Mass.:
53573.08
Organism:
Homo sapiens (Human)
Description:
P34969
Residue:
479
  
Inhibitor
Name:
BDBM21368
Synonyms:
6-[4-(2-methoxyphenyl)piperazin-1-yl]-N-(1,2,3,4-tetrahydronaphthalen-1-yl)hexanamide Piperazinehexanamide derivative, 6
Type:
Small organic molecule
Emp. Form.:
C27H37N3O2
Mol. Mass.:
435.6016
SMILES:
COc1ccccc1N1CCN(CCCCCC(=O)NC2CCCc3ccccc23)CC1
: