Target
Androgen receptor
Ligand
BDBM18525
Substrate
Meas. Tech.
ChEMBL_302725 (CHEMBL839595)
Ki
64±n/a nM
Citation
 Salvati, MEBalog, AShan, WWei, DDPickering, DAttar, RMGeng, JRizzo, CAGottardis, MMWeinmann, RKrystek, SRSack, JAn, YKish, K Structure based approach to the design of bicyclic-1H-isoindole-1,3(2H)-dione based androgen receptor antagonists. Bioorg Med Chem Lett 15:271-6 (2004)  
Target
Name:
Androgen receptor
Synonyms:
ANDR_HUMAN Androgen Receptor Androgen receptor/Baculoviral IAP repeat-containing protein 2 Dihydrotestosterone receptor Nuclear receptor subfamily 3 group C member 4
Type:
Receptor
Mol. Mass.:
99185.27
Organism:
Homo sapiens (Human)
Description:
CHO cells were stably transfected with human AR gene.
Residue:
920
  
Inhibitor
Name:
BDBM18525
Synonyms:
Bicalutamide N-[4-cyano-3-(trifluoromethyl)phenyl]-3-[(4-fluorobenzene)sulfonyl]-2-hydroxy-2-methylpropanamide US20230382870, Bicalutumide US9682960, CAS
Type:
Small organic molecule
Emp. Form.:
C18H14F4N2O4S
Mol. Mass.:
430.373
SMILES:
CC(O)(CS(=O)(=O)c1ccc(F)cc1)C(=O)Nc1ccc(C#N)c(c1)C(F)(F)F
: