Target
Peroxisome proliferator-activated receptor delta
Ligand
BDBM50157926
Substrate
Meas. Tech.
ChEMBL_305706 (CHEMBL827221)
IC50
>15000±n/a nM
Citation
 Acton, JJBlack, RMJones, ABMoller, DEColwell, LDoebber, TWMacnaul, KLBerger, JWood, HB Benzoyl 2-methyl indoles as selective PPARgamma modulators. Bioorg Med Chem Lett 15:357-62 (2004)  
Target
Name:
Peroxisome proliferator-activated receptor delta
Synonyms:
NR1C2 NUCI Nuclear receptor subfamily 1 group C member 2 PPAR-beta PPARD Peroxisome proliferator-activated receptor Peroxisome proliferator-activated receptor delta
Type:
Enzyme
Mol. Mass.:
49910.45
Organism:
Homo sapiens (Human)
Description:
Q03181
Residue:
441
  
Inhibitor
Name:
BDBM50157926
Synonyms:
2-{3-[1-(4-Methoxy-benzoyl)-2-methyl-5-trifluoromethoxy-1H-indol-3-ylmethyl]-phenoxy}-propionic acid | CHEMBL435517
Type:
Small organic molecule
Emp. Form.:
C28H24F3NO6
Mol. Mass.:
527.4885
SMILES:
COc1ccc(cc1)C(=O)n1c(C)c(Cc2cccc(OC(C)C(O)=O)c2)c2cc(OC(F)(F)F)ccc12
: