Target
Peroxisome proliferator-activated receptor gamma
Ligand
BDBM50157932
Substrate
Meas. Tech.
ChEMBL_305707 (CHEMBL827222)
IC50
23±n/a nM
Citation
 Acton, JJBlack, RMJones, ABMoller, DEColwell, LDoebber, TWMacnaul, KLBerger, JWood, HB Benzoyl 2-methyl indoles as selective PPARgamma modulators. Bioorg Med Chem Lett 15:357-62 (2004)  
Target
Name:
Peroxisome proliferator-activated receptor gamma
Synonyms:
NR1C3 PPAR-gamma PPARG_HUMAN Peroxisome proliferator-activated receptor gamma (PPAR gamma) Peroxisome proliferator-activated receptor gamma (PPARĪ³) peroxisome proliferator-activated receptor gamma isoform 2
Type:
Nuclear Receptor
Mol. Mass.:
57613.46
Organism:
Homo sapiens (Human)
Description:
P37231
Residue:
505
  
Inhibitor
Name:
BDBM50157932
Synonyms:
(R)-2-{2-[1-(4-Methoxy-benzoyl)-2-methyl-5-trifluoromethoxy-1H-indol-3-ylmethyl]-phenoxy}-propionic acid | CHEMBL182100
Type:
Small organic molecule
Emp. Form.:
C28H24F3NO6
Mol. Mass.:
527.4885
SMILES:
COc1ccc(cc1)C(=O)n1c(C)c(Cc2ccccc2O[C@H](C)C(O)=O)c2cc(OC(F)(F)F)ccc12
: