Target
5-hydroxytryptamine receptor 6
Ligand
BDBM50158025
Substrate
Meas. Tech.
ChEMBL_312778 (CHEMBL833427)
IC50
4.1±n/a nM
Citation
 Cole, DCEllingboe, JWLennox, WJMazandarani, HSmith, DLStock, JRZhang, GZhou, PSchechter, LE N1-arylsulfonyl-3-(1,2,3,6-tetrahydropyridin-4-yl)-1H-indole derivatives are potent and selective 5-HT6 receptor antagonists. Bioorg Med Chem Lett 15:379-83 (2004)  
Target
Name:
5-hydroxytryptamine receptor 6
Synonyms:
5-HT-6 5-hydroxytryptamine receptor 6 (5-HT-6) 5-hydroxytryptamine receptor 6 (5HT6) HTR6 Serotonin 6 (5-HT6) receptor | Serotonin Receptor 6
Type:
G Protein-Coupled Receptor (GPCR)
Mol. Mass.:
46968.43
Organism:
Homo sapiens (Human)
Description:
P50406
Residue:
440
  
Inhibitor
Name:
BDBM50158025
Synonyms:
5-Methoxy-1-(naphthalene-2-sulfonyl)-3-(1,2,3,6-tetrahydro-pyridin-4-yl)-1H-indole | CHEMBL178193
Type:
Small organic molecule
Emp. Form.:
C24H22N2O3S
Mol. Mass.:
418.508
SMILES:
COc1ccc2n(cc(C3=CCNCC3)c2c1)S(=O)(=O)c1ccc2ccccc2c1
: