Target
D(4) dopamine receptor
Ligand
BDBM50158026
Substrate
Meas. Tech.
ChEMBL_303265 (CHEMBL828259)
Ki
>5000±n/a nM
Citation
 Cole, DCEllingboe, JWLennox, WJMazandarani, HSmith, DLStock, JRZhang, GZhou, PSchechter, LE N1-arylsulfonyl-3-(1,2,3,6-tetrahydropyridin-4-yl)-1H-indole derivatives are potent and selective 5-HT6 receptor antagonists. Bioorg Med Chem Lett 15:379-83 (2004)  
Target
Name:
D(4) dopamine receptor
Synonyms:
D(2C) dopamine receptor DOPAMINE D4.2 DRD4 Dopamine D4 receptor
Type:
Enzyme
Mol. Mass.:
48373.19
Organism:
Homo sapiens (Human)
Description:
P21917
Residue:
419
  
Inhibitor
Name:
BDBM50158026
Synonyms:
1-(2-Fluoro-benzenesulfonyl)-3-(1,2,3,6-tetrahydro-pyridin-4-yl)-1H-indole | CHEMBL180606
Type:
Small organic molecule
Emp. Form.:
C19H17FN2O2S
Mol. Mass.:
356.414
SMILES:
Fc1ccccc1S(=O)(=O)n1cc(C2=CCNCC2)c2ccccc12
: