Target
Growth hormone secretagogue receptor type 1
Ligand
BDBM50153535
Substrate
Meas. Tech.
ChEMBL_430238 (CHEMBL914477)
IC50
130±n/a nM
Citation
 Zhao, HXin, ZLiu, GSchaefer, VGFalls, HDKaszubska, WCollins, CASham, HL Discovery of tetralin carboxamide growth hormone secretagogue receptor antagonists via scaffold manipulation. J Med Chem 47:6655-7 (2004)  
Target
Name:
Growth hormone secretagogue receptor type 1
Synonyms:
GH-releasing peptide receptor GHS-R GHSR_HUMAN Ghrelin receptor | Ghrelin receptor 1a (GHS-R1a)
Type:
Receptor
Mol. Mass.:
41334.57
Organism:
Homo sapiens (Human)
Description:
Receptor binding studies use plasma membranes from LLC PK-1 cells transiently transfected with hGHSR1a.
Residue:
366
  
Inhibitor
Name:
BDBM50153535
Synonyms:
3-(2,6-Dichloro-phenyl)-5-methyl-isoxazole-4-carboxylic acid (4-diethylamino-phenyl)-amide | CHEMBL178668
Type:
Small organic molecule
Emp. Form.:
C21H21Cl2N3O2
Mol. Mass.:
418.316
SMILES:
CCN(CC)c1ccc(NC(=O)c2c(C)onc2-c2c(Cl)cccc2Cl)cc1
: