Target
Bifunctional purine biosynthesis protein ATIC
Ligand
BDBM50158387
Substrate
Meas. Tech.
ChEMBL_430370 (CHEMBL914875)
IC50
8800±n/a nM
Citation
 Li, CXu, LWolan, DWWilson, IAOlson, AJ Virtual screening of human 5-aminoimidazole-4-carboxamide ribonucleotide transformylase against the NCI diversity set by use of AutoDock to identify novel nonfolate inhibitors. J Med Chem 47:6681-90 (2004)  
Target
Name:
Bifunctional purine biosynthesis protein ATIC
Synonyms:
5-aminoimidazole-4-carboxamide ribonucleotide formyltransferase AICAR Tfase ATIC Bifunctional purine biosynthesis protein PURH IMP cyclohydrolase Inosinicase PURH Thymidylate synthase/GAR transformylase/AICAR transformylase
Type:
Protein
Mol. Mass.:
64616.62
Organism:
Homo sapiens (Human)
Description:
P31939
Residue:
592
  
Inhibitor
Name:
BDBM50158387
Synonyms:
4-[(3-carboxy-4-hydroxy-1-naphthyl)(oxo)acetyl]-1-hydroxy-2-naphthoic acid NSC-292213
Type:
Small organic molecule
Emp. Form.:
C24H14O8
Mol. Mass.:
430.3632
SMILES:
OC(=O)c1cc(C(=O)C(=O)c2cc(C(O)=O)c(O)c3ccccc23)c2ccccc2c1O
: