Target
Dihydrofolate reductase
Ligand
BDBM50158571
Substrate
Meas. Tech.
ChEMBL_430663 (CHEMBL919631)
Ki
2.1±n/a nM
Citation
 Rosowsky, AForsch, RAWright, JE Synthesis and in vitro antifolate activity of rotationally restricted aminopterin and methotrexate analogues. J Med Chem 47:6958-63 (2004)  
Target
Name:
Dihydrofolate reductase
Synonyms:
DHFR Dihydrofolate reductase (DHFR) | Tetrahydrofolate dehydrogenase
Type:
Enzyme
Mol. Mass.:
21453.99
Organism:
Homo sapiens (Human)
Description:
Recombinant human DHFR.
Residue:
187
  
Inhibitor
Name:
BDBM50158571
Synonyms:
2-S-[5-[N-(2,4--diaminopteridin-6-yl)methyl)-N-methyl-amino]-2,3-dihydro-1-oxo-2(1H)-isoindollyl]glutaric acid | CHEMBL224946
Type:
Small organic molecule
Emp. Form.:
C21H22N8O5
Mol. Mass.:
466.45
SMILES:
CN(Cc1cnc2nc(N)nc(N)c2n1)c1ccc2C(=O)N(Cc2c1)[C@@H](CCC(O)=O)C(O)=O
: