Target
Transient receptor potential cation channel subfamily V member 1
Ligand
BDBM20510
Substrate
Meas. Tech.
ChEMBL_312864 (CHEMBL874942)
IC50
3200±n/a nM
Citation
 Doherty, EMFotsch, CBo, YChakrabarti, PPChen, NGavva, NHan, NKelly, MGKincaid, JKlionsky, LLiu, QOgnyanov, VITamir, RWang, XZhu, JNorman, MHTreanor, JJ Discovery of potent, orally available vanilloid receptor-1 antagonists. Structure-activity relationship of N-aryl cinnamides. J Med Chem 48:71-90 (2005)  
Target
Name:
Transient receptor potential cation channel subfamily V member 1
Synonyms:
Capsaicin receptor Osm-9-like TRP channel 1 TRPV1_HUMAN Transient receptor potential cation channel subfamily V member 1 (TRPV1) Transient receptor potential cation channel subfamily V member 1(TRPV1) Vanilloid VR1 Vanilloid receptor 1 Vanilloid receptor 1 (VRI/TRPV1)
Type:
Protein
Mol. Mass.:
94960.75
Organism:
Homo sapiens (Human)
Description:
Q8NER1
Residue:
839
  
Inhibitor
Name:
BDBM20510
Synonyms:
(2E)-3-(4-tert-butylphenyl)-N-(2,3-dihydro-1,4-benzodioxin-6-yl)prop-2-enamide AMG9810 trans-Cinnamide
Type:
Small organic molecule
Emp. Form.:
C21H23NO3
Mol. Mass.:
337.4122
SMILES:
CC(C)(C)c1ccc(\C=C\C(=O)Nc2ccc3OCCOc3c2)cc1
: