Target
Gastrin-releasing peptide receptor
Ligand
BDBM50158698
Substrate
Meas. Tech.
ChEMBL_306773 (CHEMBL831870)
IC50
0.06±n/a nM
Citation
 Nock, BANikolopoulou, AGalanis, ACordopatis, PWaser, BReubi, JCMaina, T Potent bombesin-like peptides for GRP-receptor targeting of tumors with 99mTc: a preclinical study. J Med Chem 48:100-10 (2005)  
Target
Name:
Gastrin-releasing peptide receptor
Synonyms:
Bombesin 2 GRP-preferring bombesin receptor GRPR_HUMAN Gastrin-releasing peptide receptor
Type:
Enzyme Catalytic Domain
Mol. Mass.:
43214.53
Organism:
Homo sapiens (Human)
Description:
Bombesin 2 GRPR 0::P30550
Residue:
384
  
Inhibitor
Name:
BDBM50158698
Synonyms:
CHEMBL266078 | [N40,Pro1,Tyr4]BB
Type:
Small organic molecule
Emp. Form.:
C83H130N28O19S
Mol. Mass.:
1856.162
SMILES:
CSCCC[C@H](NC(=O)[C@H](CC(C)C)NC(=O)[C@H](Cc1cnc[nH]1)NC(=O)CNC(=O)[C@@H](NC(=O)[C@H](C)NC(=O)[C@H](Cc1c[nH]c2ccccc12)NC(=O)[C@H](CCC(N)=O)NC(=O)[C@H](CC(N)=O)NC(=O)CNC(=O)[C@H](Cc1ccc(O)cc1)NC(=O)[C@H](CCCNC(N)=N)NC(=O)[C@H](CCC(N)=O)NC(=O)C1CCCN1C(=O)C(CNCCN)CNCCN)C(C)C)C(N)=O
: