Target
Corticotropin-releasing factor receptor 2
Ligand
BDBM50158962
Substrate
Meas. Tech.
ChEMBL_304279 (CHEMBL829880)
EC50
25±n/a nM
Citation
 Isfort, RJWang, FTscheiner, MDonnelly, EBauer, MBLefever, FHinkle, RTMazur, AW Discovery of corticotropin releasing factor 2 receptor selective sauvagine analogues for treatment of skeletal muscle atrophy. J Med Chem 48:262-5 (2005)  
Target
Name:
Corticotropin-releasing factor receptor 2
Synonyms:
CRF-R-2 CRF-RB CRFR2_MOUSE CRH-R2 Corticotropin-releasing factor receptor 2 Crf2r | Crhr2
Type:
PROTEIN
Mol. Mass.:
47628.12
Organism:
Mus musculus
Description:
ChEMBL_51276
Residue:
411
  
Inhibitor
Name:
BDBM50158962
Synonyms:
CHEMBL411474 | Sauvagine derivative
Type:
Small organic molecule
Emp. Form.:
C204H348N56O62S
Mol. Mass.:
4609.349
SMILES:
CC[C@H](C)[C@H](NC(=O)[C@@H](NC(=O)[C@H](CC(O)=O)NC(=O)[C@H](CC(C)C)NC(=O)[C@H](CC(C)C)NC(=O)[C@H](CC(C)C)NC(=O)[C@H](CCCNC(N)=N)NC(=O)[C@H](CC(N)=O)NC(=O)[C@H](CC(N)=O)NC(=O)[C@H](C)NC(=O)[C@H](C)NC(=O)[C@H](CCC(N)=O)NC(=O)[C@H](CCC(N)=O)NC(=O)[C@H](CCCCN)NC(=O)[C@H](CCC(O)=O)NC(=O)[C@H](CCCCN)NC(=O)[C@H](CCC(O)=O)NC(=O)[C@H](CCC(N)=O)NC(=O)[C@H](CCCCN)NC(=O)[C@H](CCC(O)=O)NC(=O)[C@@H](NC(=O)[C@H](CCC(O)=O)NC(=O)[C@@H](NC(=O)[C@H](CCSC)NC(=O)[C@H](CCCCN)NC(=O)[C@H](CCCNC(N)=N)NC(=O)[C@H](CC(C)C)NC(=O)[C@H](CC(C)C)NC(=O)[C@H](CCC(N)=O)NC(=O)[C@@H](NC(=O)[C@@H]1CCCN1C(=O)[C@H](CC(C)C)NC(=O)[C@H](CC(O)=O)NC(=O)[C@@H](NC(=O)[C@H](CO)NC(=O)[C@@H](NC(=O)[C@@H]1CCCN1C(=O)[C@@H]1CCCN1C(=O)CNC(=O)[C@@H]1CCC(=O)N1)[C@@H](C)CC)[C@@H](C)CC)[C@@H](C)CC)[C@@H](C)CC)[C@@H](C)CC)[C@@H](C)O)C(O)=O
: