Target
Tubulin beta-1 chain
Ligand
BDBM50159297
Substrate
Meas. Tech.
ChEMBL_305199 (CHEMBL832453)
IC50
1200±n/a nM
Citation
 Ducki, SMackenzie, GLawrence, NJSnyder, JP Quantitative structure-activity relationship (5D-QSAR) study of combretastatin-like analogues as inhibitors of tubulin assembly. J Med Chem 48:457-65 (2005)  
Target
Name:
Tubulin beta-1 chain
Synonyms:
TBB1_HUMAN | TUBB1
Type:
PROTEIN
Mol. Mass.:
50311.77
Organism:
Homo sapiens (Human)
Description:
ChEMBL_305173
Residue:
451
  
Inhibitor
Name:
BDBM50159297
Synonyms:
(E)-3-(3''-Fluoro-4''-methoxyphenyl)-1-(3',4',5'-trimethoxyphenyl)prop-2-en-1-one (E)-3-(3-Fluoro-4-methoxy-phenyl)-1-(3,4,5-trimethoxy-phenyl)-propenone | CHEMBL193038
Type:
Small organic molecule
Emp. Form.:
C19H19FO5
Mol. Mass.:
346.3496
SMILES:
COc1ccc(\C=C\C(=O)c2cc(OC)c(OC)c(OC)c2)cc1F
: