Target
Tubulin beta-1 chain
Ligand
BDBM50070107
Substrate
Meas. Tech.
ChEMBL_305199 (CHEMBL832453)
IC50
460±n/a nM
Citation
 Ducki, SMackenzie, GLawrence, NJSnyder, JP Quantitative structure-activity relationship (5D-QSAR) study of combretastatin-like analogues as inhibitors of tubulin assembly. J Med Chem 48:457-65 (2005)  
Target
Name:
Tubulin beta-1 chain
Synonyms:
TBB1_HUMAN | TUBB1
Type:
PROTEIN
Mol. Mass.:
50311.77
Organism:
Homo sapiens (Human)
Description:
ChEMBL_305173
Residue:
451
  
Inhibitor
Name:
BDBM50070107
Synonyms:
(E)-3-(3''-Hydroxy-4''-methoxyphenyl)-2-methyl-1-(3',4',5'-trimethoxyphenyl)prop-2-en-1-one (E)-3-(3-hydroxy-4-methoxyphenyl)-2-methyl-1-(3,4,5-trimethoxyphenyl)prop-2-en-1-one CHEMBL9859
Type:
Small organic molecule
Emp. Form.:
C20H22O6
Mol. Mass.:
358.3851
SMILES:
COc1ccc(\C=C(/C)C(=O)c2cc(OC)c(OC)c(OC)c2)cc1O
: