Target
Somatostatin receptor type 1
Ligand
BDBM50159393
Substrate
Meas. Tech.
ChEMBL_306609 (CHEMBL829069)
IC50
5.2±n/a nM
Citation
 Erchegyi, JHoeger, CALow, WHoyer, DWaser, BEltschinger, VSchaer, JCCescato, RReubi, JCRivier, JE Somatostatin receptor 1 selective analogues: 2. N(alpha)-Methylated scan. J Med Chem 48:507-14 (2005)  
Target
Name:
Somatostatin receptor type 1
Synonyms:
SOMATOSTATIN SST1 SS-1-R SS1R SSTR1 | Somatostatin receptor type 1 (SSTR1)
Type:
Enzyme
Mol. Mass.:
42692.81
Organism:
Homo sapiens (Human)
Description:
P30872
Residue:
391
  
Inhibitor
Name:
BDBM50159393
Synonyms:
CHEMBL407051 | Des-AA1,2,5-[D-Trp8,(NalphaMe)IAmp9,m-I-Tyr11]SRIF
Type:
Small organic molecule
Emp. Form.:
C75H97IN14O16S2
Mol. Mass.:
1641.691
SMILES:
CC(C)NCc1ccc(C[C@@H]2N(C)C(=O)[C@H](Cc3c[nH]c4ccccc34)NC(=O)[C@H](Cc3ccccc3)NC(=O)[C@@H](Cc3ccccc3)NC(=O)[C@@H](CCCCN)NC(=O)[C@H](N)CSSC[C@H](NC(=O)[C@H](CO)NC(=O)[C@H](NC(=O)[C@H](Cc3ccc(O)cc3I)NC(=O)[C@H](NC2=O)[C@@H](C)O)[C@@H](C)O)C(O)=O)cc1
: