Target
Alpha-1A adrenergic receptor
Ligand
BDBM50050917
Substrate
Meas. Tech.
ChEMBL_303343 (CHEMBL840159)
Ki
4.1±n/a nM
Citation
 Li, MYTsai, KCXia, L Pharmacophore identification of alpha(1A)-adrenoceptor antagonists. Bioorg Med Chem Lett 15:657-64 (2005)  
Target
Name:
Alpha-1A adrenergic receptor
Synonyms:
ADA1A_HUMAN ADRA1C Alpha 1A-adrenoceptor Alpha adrenergic receptor 1a Alpha-adrenergic receptor 1c adrenergic Alpha1 | adrenergic Alpha1C
Type:
Cell-surface receptors
Mol. Mass.:
51511.67
Organism:
Homo sapiens (Human)
Description:
P35348
Residue:
466
  
Inhibitor
Name:
BDBM50050917
Synonyms:
CHEMBL42539 | [2-(2,6-Dimethoxy-phenoxy)-ethyl]-(3-p-tolyl-2,3-dihydro-benzo[1,4]dioxin-2-ylmethyl)-amine
Type:
Small organic molecule
Emp. Form.:
C26H29NO5
Mol. Mass.:
435.5122
SMILES:
COc1cccc(OC)c1OCCNCC1Oc2ccccc2OC1c1ccc(C)cc1
: