Target
Alpha-1A adrenergic receptor
Ligand
BDBM50160158
Substrate
Meas. Tech.
ChEMBL_303343 (CHEMBL840159)
Ki
59±n/a nM
Citation
 Li, MYTsai, KCXia, L Pharmacophore identification of alpha(1A)-adrenoceptor antagonists. Bioorg Med Chem Lett 15:657-64 (2005)  
Target
Name:
Alpha-1A adrenergic receptor
Synonyms:
ADA1A_HUMAN ADRA1C Alpha 1A-adrenoceptor Alpha adrenergic receptor 1a Alpha-adrenergic receptor 1c adrenergic Alpha1 | adrenergic Alpha1C
Type:
Cell-surface receptors
Mol. Mass.:
51511.67
Organism:
Homo sapiens (Human)
Description:
P35348
Residue:
466
  
Inhibitor
Name:
BDBM50160158
Synonyms:
1-{4-[4-(2-Isopropoxy-phenyl)-piperazin-1-yl]-2-oxo-butyl}-5-oxo-pyrrolidine-2-carboxylic acid ethyl ester RWJ-68141
Type:
Small organic molecule
Emp. Form.:
C24H35N3O5
Mol. Mass.:
445.5518
SMILES:
CCOC(=O)C1CCC(=O)N1CC(=O)CCN1CCN(CC1)c1ccccc1OC(C)C
: