Target
C-C chemokine receptor type 3
Ligand
BDBM50160173
Substrate
Meas. Tech.
ChEMBL_303512 (CHEMBL838626)
Ki
76±n/a nM
Citation
 Anderskewitz, RBauer, RBodenbach, GGester, DGramlich, BMorschhäuser, GBirke, FW Pyrrolidinohydroquinazolines--a novel class of CCR3 modulators. Bioorg Med Chem Lett 15:669-73 (2005)  
Target
Name:
C-C chemokine receptor type 3
Synonyms:
C-C CKR-3 CC-CKR-3 CCR3 CD_antigen=CD193 CMKBR3 | Eosinophil eotaxin receptor
Type:
Enzyme
Mol. Mass.:
41053.88
Organism:
Homo sapiens (Human)
Description:
P51677
Residue:
355
  
Inhibitor
Name:
BDBM50160173
Synonyms:
3-[1-(2-Iodo-phenyl)-meth-(E)-ylidene]-2,3-dihydro-1H-pyrrolo[2,1-b]quinazolin-(9Z)-ylideneamine | CHEMBL183461
Type:
Small organic molecule
Emp. Form.:
C18H14IN3
Mol. Mass.:
399.2283
SMILES:
Ic1ccccc1\C=C1/CCn2c1nc1ccccc1c2=N
: