Target
C-C chemokine receptor type 3
Ligand
BDBM50160191
Substrate
Meas. Tech.
ChEMBL_303512 (CHEMBL838626)
Ki
1200±n/a nM
Citation
 Anderskewitz, RBauer, RBodenbach, GGester, DGramlich, BMorschhäuser, GBirke, FW Pyrrolidinohydroquinazolines--a novel class of CCR3 modulators. Bioorg Med Chem Lett 15:669-73 (2005)  
Target
Name:
C-C chemokine receptor type 3
Synonyms:
C-C CKR-3 CC-CKR-3 CCR3 CD_antigen=CD193 CMKBR3 | Eosinophil eotaxin receptor
Type:
Enzyme
Mol. Mass.:
41053.88
Organism:
Homo sapiens (Human)
Description:
P51677
Residue:
355
  
Inhibitor
Name:
BDBM50160191
Synonyms:
8-[1-(2-Bromo-phenyl)-meth-(E)-ylidene]-3-tert-butyl-7,8-dihydro-6H-pyrrolo[1,2-a]thieno[2,3-d]pyrimidin-(4Z)-ylideneamine | CHEMBL361430
Type:
Small organic molecule
Emp. Form.:
C20H20BrN3S
Mol. Mass.:
414.362
SMILES:
CC(C)(C)c1csc2nc3\C(CCn3c(=N)c12)=C\c1ccccc1Br
: