Target
DNA polymerase III subunit alpha
Ligand
BDBM50160354
Substrate
Meas. Tech.
ChEMBL_302895 (CHEMBL830211)
Ki
95000±n/a nM
Citation
 Wright, GEBrown, NCXu, WCLong, ZYZhi, CGambino, JJBarnes, MHButler, MM Active site directed inhibitors of replication-specific bacterial DNA polymerases. Bioorg Med Chem Lett 15:729-32 (2005)  
Target
Name:
DNA polymerase III subunit alpha
Synonyms:
DNA polymerase III dnaE DNA polymerase IIIE dnaE | polC
Type:
Enzyme
Mol. Mass.:
129872.84
Organism:
Escherichia coli
Description:
Enzyme was purified from recombinant strains.
Residue:
1160
  
Inhibitor
Name:
BDBM50160354
Synonyms:
2-(3,4-Dichloro-benzylamino)-1,9-dihydro-purin-6-one | CHEMBL183665
Type:
Small organic molecule
Emp. Form.:
C12H9Cl2N5O
Mol. Mass.:
310.139
SMILES:
Clc1ccc(CNc2nc3nc[nH]c3c(=O)[nH]2)cc1Cl
: