Target
Sodium-dependent serotonin transporter
Ligand
BDBM50160610
Substrate
Meas. Tech.
ChEMBL_303700 (CHEMBL828187)
Ki
12.1±n/a nM
Citation
 Evrard, DAZhou, PYi, SYZhou, DSmith, DLSullivan, KMHornby, GASchechter, LEAndree, THMewshaw, RE Studies towards the next generation of antidepressants. Part 4: derivatives of 4-(5-fluoro-1H-indol-3-yl)cyclohexylamine with affinity for the serotonin transporter and the 5-HT1A receptor. Bioorg Med Chem Lett 15:911-4 (2005)  
Target
Name:
Sodium-dependent serotonin transporter
Synonyms:
5-HT Transporter 5HT transporter Anandamid membrane transporter, AMT Monoamine transporters; Norepinephrine & serotonin Slc6a4 Sodium-dependent serotonin transporter (SERT) | imipramine receptor
Type:
Multi-pass membrane protein
Mol. Mass.:
70168.43
Organism:
Rattus norvegicus (rat)
Description:
P31652
Residue:
630
  
Inhibitor
Name:
BDBM50160610
Synonyms:
CHEMBL178304 | [2-(2,3-Dihydro-benzo[1,4]dioxin-5-yloxy)-ethyl]-[4-(5-fluoro-1H-indol-3-yl)-cyclohexyl]-amine
Type:
Small organic molecule
Emp. Form.:
C24H27FN2O3
Mol. Mass.:
410.4812
SMILES:
Fc1ccc2[nH]cc([C@@H]3CC[C@@H](CC3)NCCOc3cccc4OCCOc34)c2c1
: