Target
Integrin alpha-L/beta-2
Ligand
BDBM50160919
Substrate
Meas. Tech.
ChEMBL_313000 (CHEMBL873341)
IC50
175±n/a nM
Citation
 Potin, DLaunay, MNicolai, EFabreguette, MMalabre, PCaussade, FBesse, DSkala, SStetsko, DKTodderud, GBeno, BRCheney, DLChang, CJSheriff, SHollenbaugh, DLBarrish, JCIwanowicz, EJSuchard, SJDhar, TG De novo design, synthesis, and in vitro activity of LFA-1 antagonists based on a bicyclic[5.5]hydantoin scaffold. Bioorg Med Chem Lett 15:1161-4 (2005)  
Target
Name:
Integrin alpha-L/beta-2
Synonyms:
Integrin alpha-L/beta-2 (LFA-1) | Integrin beta-2/Leukocyte adhesion glycoprotein LFA-1 alpha
Type:
Mol. Mass.:
Description:
ASSAY_ID of EBI is 32646
Components:
This complex has 2 components.
Component 1
Name:
Integrin alpha-L
Synonyms:
CD11 antigen-like family member A CD_antigen=CD11a ITGAL LFA-1A Leukocyte adhesion glycoprotein LFA-1 alpha chain | Leukocyte function-associated molecule 1 alpha chain
Type:
PROTEIN
Mol. Mass.:
128748.90
Organism:
Homo sapiens (Human)
Description:
ChEMBL_629045
Residue:
1170
  
Component 2
Name:
Integrin beta-2
Synonyms:
CD18 ITGB2 MFI7
Type:
PROTEIN
Mol. Mass.:
84785.60
Organism:
Homo sapiens (Human)
Description:
EBI_12662
Residue:
769
  
Inhibitor
Name:
BDBM50160919
Synonyms:
(6S,7aS)-6-[(4''-Bromo-biphenyl-3-ylmethyl)-methyl-amino]-2-(3,5-dichloro-phenyl)-tetrahydro-pyrrolo[1,2-c]imidazole-1,3-dione | CHEMBL361737
Type:
Small organic molecule
Emp. Form.:
C26H22BrCl2N3O2
Mol. Mass.:
559.282
SMILES:
CN(Cc1cccc(c1)-c1ccc(Br)cc1)[C@H]1Cc2c(O)n(-c3cc(Cl)cc(Cl)c3)c(=O)n2C1
: