Target
Caspase-4
Ligand
BDBM50160957
Substrate
Meas. Tech.
ChEMBL_305287 (CHEMBL832836)
IC50
0.500000±n/a nM
Citation
 Han, YGiroux, AColucci, JBayly, CIMckay, DJRoy, SXanthoudakis, SVaillancourt, JRasper, DMTam, JTawa, PNicholson, DWZamboni, RJ Novel pyrazinone mono-amides as potent and reversible caspase-3 inhibitors. Bioorg Med Chem Lett 15:1173-80 (2005)  
Target
Name:
Caspase-4
Synonyms:
CASP-4 CASP4_HUMAN Caspase-4 subunit 1 ICE(rel)-II ICH2 | TX protease
Type:
Enzyme
Mol. Mass.:
43257.75
Organism:
Homo sapiens (Human)
Description:
P49662
Residue:
377
  
Inhibitor
Name:
BDBM50160957
Synonyms:
CHEMBL179503 | [3-(2-{5-tert-Butyl-3-[(4-methyl-furazan-3-ylmethyl)-amino]-2-oxo-2H-pyrazin-1-yl}-butyrylamino)-4-carboxy-2-oxo-butyl]-methyl-pentyl-ammonium; chloride
Type:
Small organic molecule
Emp. Form.:
C27H44N7O6
Mol. Mass.:
562.681
SMILES:
CCCCC[NH+](C)CC(=O)C(CC(O)=O)NC(=O)C(CC)n1cc(nc(NCc2nonc2C)c1=O)C(C)(C)C
: