Target
Caspase-7
Ligand
BDBM50160976
Substrate
Meas. Tech.
ChEMBL_305652 (CHEMBL829510)
IC50
0.140000±n/a nM
Citation
 Han, YGiroux, AColucci, JBayly, CIMckay, DJRoy, SXanthoudakis, SVaillancourt, JRasper, DMTam, JTawa, PNicholson, DWZamboni, RJ Novel pyrazinone mono-amides as potent and reversible caspase-3 inhibitors. Bioorg Med Chem Lett 15:1173-80 (2005)  
Target
Name:
Caspase-7
Synonyms:
Apoptotic protease Mch-3 CASP7 CMH-1 MCH3 | caspase 7, apoptosis-related cysteine peptidase
Type:
Enzyme
Mol. Mass.:
34273.91
Organism:
Homo sapiens (Human)
Description:
P55210
Residue:
303
  
Inhibitor
Name:
BDBM50160976
Synonyms:
(3S)-3-(2-(5-tert-butyl-3-((4-methyl-1,2,5-oxadiazol-3-yl)methylamino)-2-oxopyrazin-1(2H)-yl)butanamido)-4-oxo-7-phenylheptanoic acid CHEMBL180623
Type:
Small organic molecule
Emp. Form.:
C29H38N6O6
Mol. Mass.:
566.6486
SMILES:
CCC(C(=O)N[C@@H](CC(O)=O)C(=O)CCCc1ccccc1)n1cc(nc(NCc2nonc2C)c1=O)C(C)(C)C
: