Target
Steryl-sulfatase
Ligand
BDBM50161124
Substrate
Meas. Tech.
ChEMBL_302806 (CHEMBL838514)
Ki
220±n/a nM
Citation
 Lehr, PBillich, AWolff, BNussbaumer, P N-Acyl arylsulfonamides as novel, reversible inhibitors of human steroid sulfatase. Bioorg Med Chem Lett 15:1235-8 (2005)  
Target
Name:
Steryl-sulfatase
Synonyms:
ARSC1 Arylsulfatase C STS_HUMAN Steryl-sulfate sulfohydrolase
Type:
Enzyme
Mol. Mass.:
65503.66
Organism:
Homo sapiens (Human)
Description:
P08842
Residue:
583
  
Inhibitor
Name:
BDBM50161124
Synonyms:
4-(3,5-Bis-trifluoromethyl-benzenesulfonylaminocarbonyl)-piperidine-1-carboxylic acid tert-butyl ester | CHEMBL181738
Type:
Small organic molecule
Emp. Form.:
C19H22F6N2O5S
Mol. Mass.:
504.444
SMILES:
CC(C)(C)OC(=O)N1CCC(CC1)C(=O)NS(=O)(=O)c1cc(cc(c1)C(F)(F)F)C(F)(F)F
: