Target
Ephrin type-B receptor 1
Ligand
BDBM16673
Substrate
Meas. Tech.
ChEMBL_325031 (CHEMBL860665)
Kd
1700±n/a nM
Citation
 Fabian, MABiggs, WHTreiber, DKAtteridge, CEAzimioara, MDBenedetti, MGCarter, TACiceri, PEdeen, PTFloyd, MFord, JMGalvin, MGerlach, JLGrotzfeld, RMHerrgard, SInsko, DEInsko, MALai, AGLélias, JMMehta, SAMilanov, ZVVelasco, AMWodicka, LMPatel, HKZarrinkar, PPLockhart, DJ A small molecule-kinase interaction map for clinical kinase inhibitors. Nat Biotechnol 23:329-36 (2005)  
Target
Name:
Ephrin type-B receptor 1
Synonyms:
ELK EPHB1 EPHT2 Ephrin type-B receptor 1 NET
Type:
Enzyme Catalytic Domain
Mol. Mass.:
109882.53
Organism:
Homo sapiens (Human)
Description:
EPH receptor B1 EPHB1 HUMAN::P54762
Residue:
984
  
Inhibitor
Name:
BDBM16673
Synonyms:
4-[4-({[4-chloro-3-(trifluoromethyl)phenyl]carbamoyl}amino)phenoxy]-N-methylpyridine-2-carboxamide BAY 43-9006 BAY439006 Hit compound, 8 Sorafenib US10183928, Sorafenib US10227329, Compound Sorafenib US10774070, Compound Sorafenib US11279688, Compound Sorafenib US9029401, Sorafenib US9902709, Comparative example 1 cid_216239
Type:
Small organic molecule
Emp. Form.:
C21H16ClF3N4O3
Mol. Mass.:
464.825
SMILES:
CNC(=O)c1cc(Oc2ccc(NC(=O)Nc3ccc(Cl)c(c3)C(F)(F)F)cc2)ccn1
: