Target
Gonadotropin-releasing hormone receptor
Ligand
BDBM50132726
Substrate
Meas. Tech.
ChEMBL_303063 (CHEMBL828889)
Ki
5.5±n/a nM
Citation
 Pontillo, JChen, C Efficient synthesis of bicyclic oxazolino- and thiazolino[3,2-c]pyrimidine-5,7-diones and its application to the synthesis of GnRH antagonists. Bioorg Med Chem Lett 15:1407-11 (2005)  
Target
Name:
Gonadotropin-releasing hormone receptor
Synonyms:
GNRHR GRHR GnRH-R Gonadotropin-releasing hormone receptor | Gonadotropin-releasing hormone receptor (GnRH)
Type:
Enzyme
Mol. Mass.:
37749.45
Organism:
Homo sapiens (Human)
Description:
P30968
Residue:
328
  
Inhibitor
Name:
BDBM50132726
Synonyms:
(R)-1-(2,6-difluorobenzyl)-5-(3-methoxyphenyl)-6-methyl-3-(2-(methyl(pyridin-2-ylmethyl)amino)propyl)pyrimidine-2,4(1H,3H)-dione CHEMBL112466
Type:
Small organic molecule
Emp. Form.:
C29H30F2N4O3
Mol. Mass.:
520.5703
SMILES:
COc1cccc(c1)-c1c(C)n(Cc2c(F)cccc2F)c(=O)n(C[C@@H](C)N(C)Cc2ccccn2)c1=O
: