Target
Fatty-acid amide hydrolase 1
Ligand
BDBM50073985
Substrate
Meas. Tech.
ChEMBL_303730 (CHEMBL829636)
Ki
130±n/a nM
Citation
 Leung, DDu, WHardouin, CCheng, HHwang, ICravatt, BFBoger, DL Discovery of an exceptionally potent and selective class of fatty acid amide hydrolase inhibitors enlisting proteome-wide selectivity screening: concurrent optimization of enzyme inhibitor potency and selectivity. Bioorg Med Chem Lett 15:1423-8 (2005)  
Target
Name:
Fatty-acid amide hydrolase 1
Synonyms:
Anandamide amidohydrolase FAAH1_MOUSE Faah1 Fatty-acid amide hydrolase (FAAH) Oleamide hydrolase 1
Type:
Hydrolase; single-pass membrane protein; homodimer
Mol. Mass.:
63227.28
Organism:
Mus musculus (mouse)
Description:
Mouse brain membranes were used in the assay.
Residue:
579
  
Inhibitor
Name:
BDBM50073985
Synonyms:
1,1,1-Trifluoro-undecan-2-one CHEMBL90258
Type:
Small organic molecule
Emp. Form.:
C11H19F3O
Mol. Mass.:
224.2632
SMILES:
CCCCCCCCCC(=O)C(F)(F)F
: