Target
Hexokinase-4
Ligand
BDBM50161694
Substrate
Meas. Tech.
ChEMBL_304261 (CHEMBL829031)
EC50
6500±n/a nM
Citation
 Castelhano, ALDong, HFyfe, MCGardner, LSKamikozawa, YKurabayashi, SNawano, MOhashi, RProcter, MJQiu, LRasamison, CMSchofield, KLShah, VKUeta, KWilliams, GMWitter, DYasuda, K Glucokinase-activating ureas. Bioorg Med Chem Lett 15:1501-4 (2005)  
Target
Name:
Hexokinase-4
Synonyms:
Gck Hexokinase type IV
Type:
PROTEIN
Mol. Mass.:
52101.81
Organism:
Rattus norvegicus
Description:
ChEMBL_1279785
Residue:
465
  
Inhibitor
Name:
BDBM50161694
Synonyms:
3-(5-Bromo-thiazol-2-yl)-1-(4-methanesulfonyl-phenyl)-1-thiophen-3-ylmethyl-urea | CHEMBL181375
Type:
Small organic molecule
Emp. Form.:
C16H14BrN3O3S3
Mol. Mass.:
472.4
SMILES:
CS(=O)(=O)c1ccc(cc1)N(Cc1ccsc1)C(=O)Nc1ncc(Br)s1
: